pouet

4 jobs for master in 5 minutes and 12 seconds (queued for 3 seconds)
latest
Status Job ID Name Coverage
  Quality Assurance
passed #10365
linters

00:00:55

canceled #10363
allowed to fail
linters

00:00:03

 
  Build
failed #10366
build-deb

00:05:04

canceled #10364
build-deb

00:00:20

 
Name Stage Failure
failed
build-deb Build
----------------------------------------------------------------------
Ran 1 test in 0.000s

FAILED (errors=1)
E: pybuild pybuild:352: test: plugin distutils failed with: exit code=1: cd /builds/pa/attestation/.pybuild/cpython3_3.8/build; python3.8 -m unittest discover -v
dh_auto_test: error: pybuild --test -i python{version} -p 3.8 returned exit code 13
make: *** [debian/rules:5: build] Error 25
dpkg-buildpackage: error: debian/rules build subprocess returned exit status 2
ERROR: Job failed: exit code 1